Pronuncia
type: Class
subclass of: Un documento
subclass of: Qualcosa determinato in una riunone
comment: Modella i testi delle sentenze e ordinanze della Corte Costituzionale.

Qualcosa determinato in una riunone
type: Class
comment: Modella qualsiasi cosa che possa essere deciso dopo una riunione.

Un documento
type: Class
comment: Modella un documento.