Giudice
type: Class
comment: Definisce un giudice all'interno della Corte Costituzionale.
subclass of: Persona

Francesco Paolo Bonifacio
type: Giudice
comment: BONIFACIO prof. Francesco Paolo, nato a Castellammare di Stabia (NA) il 3 maggio 1923. Professore ordinario di diritto romano. Nominato Giudice Costituzionale dal Parlamento il 2 ottobre 1963, giura il 25 ottobre 1963. Eâ€™ eletto Presidente il 23 febbraio 1973. Cessa dalla carica di Presidente il 25 ottobre 1975.
title: Presidente
surname: BONIFACIO