Giovanni Maria Flick
type: Giudice
comment: Professore ordinario universitario, nato a CiriÃ¨ (To) il 7 novembre 1940, nominato dal Presidente della Repubblica il 14 febbraio 2000. Giura il 18 febbraio 2000. Eletto Presidente della Corte costituzionale il 14 novembre 2008.
surname: FLICK
title: Presidente

Giudice
type: Class
comment: Definisce un giudice all'interno della Corte Costituzionale.
subclass of: Persona