Giudice
type: Class
comment: Definisce un giudice all'interno della Corte Costituzionale.
subclass of: Persona

Guido Neppi Modona
type: Giudice
comment: NEPPI MODONA prof. avv. Guido, nato a Torino il 14 novembre 1938. Professore ordinario di istituzioni diritto e procedura penale. Nominato dal Presidente della Repubblica il 4 novembre 1996. Giura il 6 novembre 1996.
surname: NEPPI MODONA
title: Vice Presidente