Giudice
type: Class
comment: Definisce un giudice all'interno della Corte Costituzionale.
subclass of: Persona

Piero Alberto Capotosti
type: Giudice
comment: CAPOTOSTI prof. avv. Piero Alberto, nato a S. Benedetto del Tronto (AP) il 1 marzo 1942. Professore ordinario di istituzioni di diritto pubblico. Nominato dal Presidente della Repubblica il 4 novembre 1996. Giura il 6 novembre 1996.
surname: CAPOTOSTI
title: Presidente