Giudice
type: Class
comment: Definisce un giudice all'interno della Corte Costituzionale.
subclass of: Persona

Fernanda Contri
type: Giudice
comment: CONTRI avv. Fernanda, nata a Ivrea (TO) il 21 agosto1935. Avvocato. Nominato dal Presidente della Repubblica il 4 novembre 1996. Giura il 6 novembre 1996.
surname: CONTRI
title: Vice Presidente