Giudice
type: Class
comment: Definisce un giudice all'interno della Corte Costituzionale.
subclass of: Persona

Gustavo Zagrebelsky
type: Giudice
comment: ZAGREBELSKY prof. Gustavo, nato a S. Germano Chisone (TO) il 1 giugno 1943. Professore ordinario di diritto costituzionale. Nominato dal Presidente della Repubblica il 9 settembre 1995. Giura il 13 settembre 1995.
surname: ZAGREBELSKY
title: Presidente