Giudice
type: Class
comment: Definisce un giudice all'interno della Corte Costituzionale.
subclass of: Persona

Antonio Baldassarre
type: Giudice
comment: BALDASSARRE prof. Antonio, nato a Foligno (PG) il 18 dicembre 1940. Professore ordinario di diritto costituzionale. Nominato Giudice Costituzionale dal Presidente della Repubblica l'8 agosto 1986, giura l'8 settembre 1986. Eâ€™ eletto Presidente il 23 febbraio 1995. Ha esercitato le funzioni dal 26 febbraio 1995. Cessa dalla carica di Presidente l'8 settembre 1995.
surname: BALDASSARRE
title: Presidente