Giudice
type: Class
comment: Definisce un giudice all'interno della Corte Costituzionale.
subclass of: Persona

Giuliano Vassalli
type: Giudice
comment: VASSALLI sen. prof. avv. Giuliano, nato a Perugia 25 aprile 1915. Avvocato, giÃ professore ordinario di diritto penale. Nominato dal Presidente della Repubblica il 4 febbraio1991, giura il 13 febbraio 1991. E' eletto Presidente l'11 novembre 1999. Cessa dalla carica di Presidente il 13 febbraio 2000.
surname: VASSALLI
title: Presidente