Giudice
type: Class
comment: Definisce un giudice all'interno della Corte Costituzionale.
subclass of: Persona

Edoardo Volterra
type: Giudice
comment: VOLTERRA prof. Edoardo, nato a Roma 7 gennaio 1904. Professore ordinario di istituzioni di diritto romano. Nominato dal Presidente della Repubblica il 5 gennaio 1973. Giura il 23 gennaio 1973. Eâ€™ nominato Vice Presidente il 14 ottobre 1981. Cessa dalla carica di Vice Presidente il 23 gennaio 1982.
surname: VOLTERRA
title: Vice Presidente