Giudice
type: Class
comment: Definisce un giudice all'interno della Corte Costituzionale.
subclass of: Persona

Livio Paladin
type: Giudice
comment: PALADIN prof. Livio, nato a Trieste il 30 novembre 1933. Professore ordinario di diritto costituzionale. Nominato Giudice Costituzionale dal Presidente della Repubblica il 23 giugno 1977, giura il 1 luglio 1977. Eâ€™ eletto Presidente il 3 luglio 1985. Cessa dalla carica di Presidente il 1 luglio 1986.
surname: PALADIN
title: Presidente