Guido Astuti
type: Giudice
comment: ASTUTI prof. avv. Guido, nato a Torino il 15 settembre 1910. Professore ordinario di storia del diritto italiano. Nominato dal Presidente della Repubblica il 19 febbraio 1973. Giura il 22 febbraio 1973. Cessa dalla carica di Giudice costituzionale il 7 ottobre 1980.
surname: ASTUTI
title: Giudice costituzionale

Giudice
type: Class
comment: Definisce un giudice all'interno della Corte Costituzionale.
subclass of: Persona