Giudice
type: Class
comment: Definisce un giudice all'interno della Corte Costituzionale.
subclass of: Persona

Luigi Oggioni
type: Giudice
comment: OGGIONI dott. Luigi, nato a Caltanissetta 20 marzo 1892. GiÃ Primo Presidente della Corte di cassazione. Nominato dal Presidente della Repubblica il 16 agosto 1966. Giura il 29 settembre 1966. Eâ€™ nominato Vice Presidente il 15 luglio 1975. Cessa dalla carica di Vice Presidente il 29 settembre 1978.
surname: OGGIONI
title: Vice Presidente