Luigi Mengoni
type: Giudice
comment: MENGONI prof. Luigi, nato a Villazzano (TN) il 25 agosto 1922. Professore ordinario di diritto civile. Nominato dal Presidente della Repubblica il 27 ottobre 1987. Giura il 3 novembre 1987. Eâ€™ nominato Vice Presidente il 24 ottobre 1995. Cessa dalla carica di Vice Presidente il 3 novembre 1996.
surname: MENGONI
title: Vice Presidente

Giudice
type: Class
comment: Definisce un giudice all'interno della Corte Costituzionale.
subclass of: Persona