Giudice
type: Class
comment: Definisce un giudice all'interno della Corte Costituzionale.
subclass of: Persona

Antonio La Pergola
type: Giudice
comment: LA PERGOLA prof. Antonio, nato a Catania il 13 novembre 1931. Professore ordinario di diritto pubblico generale. Nominato Giudice Costituzionale dal Presidente della Repubblica il 7 giugno 1978, giura il 14 giugno 1978. Eâ€™ eletto Presidente il 24 giugno 1986. Ha esercitato le funzioni dal 2 luglio 1986. Cessa dalla carica di Presidente il 14 giugno 1987.
surname: LA PERGOLA
title: Presidente