Giudice
type: Class
comment: Definisce un giudice all'interno della Corte Costituzionale.
subclass of: Persona

Virgilio Andrioli
type: Giudice
comment: ANDRIOLI prof. Virgilio, nato a Roma 4 febbraio 1909. Professore ordinario di diritto processuale civile. Nominato dal Presidente della Repubblica lâ€™11 ottobre 1978. Giura il 26 ottobre 1978. Eâ€™ nominato Vice Presidente il 2 luglio 1986. Cessa dalla carica di Vice Presidente il 26 ottobre 1987.
surname: ANDRIOLI
title: Vice Presidente