Giudice
type: Class
comment: Definisce un giudice all'interno della Corte Costituzionale.
subclass of: Persona

Giuseppe Ferrari
type: Giudice
comment: FERRARI prof. Giuseppe, nato a Rossano (CS) il 1 dicembre 1912. Professore ordinario di diritto pubblico generale. Nominato dal Presidente della Repubblica il 21 ottobre 1980. Giura il 7 novembre 1980. Cessa dalla carica di Giudice costituzionale l'11 giugno 1987.
surname: FERRARI
title: Giudice costituzionale