Giudice
type: Class
comment: Definisce un giudice all'interno della Corte Costituzionale.
subclass of: Persona

Vezio Crisafulli
type: Giudice
comment: CRISAFULLI prof. avv. Vezio, nato a Genova il 9 settembre 1910. Professore ordinario di diritto costituzionale. Nominato dal Presidente della Repubblica il 14 maggio 1968. Giura il 25 maggio 1968. Cessa dalla carica di Giudice costituzionale il 25 maggio 1977 (da Giudice prorogato il 2 agosto 1979).
title: Giudice costituzionale
surname: CRISAFULLI