Giudice
type: Class
comment: Definisce un giudice all'interno della Corte Costituzionale.
subclass of: Persona

Giovanni Conso
type: Giudice
comment: CONSO prof. Giovanni, nato a Torino il 23 marzo 1922. Professore ordinario di procedura penale. Nominato Giudice Costituzionale dal Presidente della Repubblica il 25 gennaio 1982, giura il 3 febbraio 1982. Eâ€™ eletto Presidente il 18 ottobre 1990. Ha esercitato le funzioni dal 23 ottobre 1990. Cessa dalla carica di Presidente il 3 febbraio 1991.
surname: CONSO
title: Presidente