Enzo Cheli
type: Giudice
comment: CHELI prof. Enzo, nato ad Arezzo il 10 maggio 1934. Professore ordinario di diritto costituzionale. Nominato dal Presidente della Repubblica il 27 ottobre 1987. Giura il 3 novembre 1987. Eâ€™ nominato Vice Presidente il 10 giugno 1996. Cessa dalla carica di Vice Presidente il 3 novembre 1996.
surname: CHELI
title: Vice Presidente

Giudice
type: Class
comment: Definisce un giudice all'interno della Corte Costituzionale.
subclass of: Persona