Paolo Grossi
type: Giudice
comment: Professore ordinario di storia del diritto medievale e moderno, nato a Firenze il 29 gennaio 1933, nominato dal Presidente della Repubblica il 17 febbraio 2009. Giura il 23 febbraio 2009. E' eletto Presidente il 24 febbraio 2016. Cessa dalla carica di presidente e giudice il 23 febbraio 2018.
surname: GROSSI
title: Presidente

Giudice
type: Class
comment: Definisce un giudice all'interno della Corte Costituzionale.
subclass of: Persona