Giudice
type: Class
comment: Definisce un giudice all'interno della Corte Costituzionale.
subclass of: Persona

Giuseppe Tesauro
type: Giudice
comment: Professore ordinario di diritto internazionale, nato a Napoli il 15 novembre 1942, nominato dal Presidente della Repubblica il 4 novembre 2005. Giura il 9 novembre 2005.
surname: TESAURO
title: Presidente