Maria Rita Saulle
type: Giudice
comment: Professore Emerito di diritto internazionale, nata a Caserta il 3 dicembre 1935, nominata dal Presidente della Repubblica il 4 novembre 2005. Giura il 9 novembre 2005.
surname: SAULLE
title: Giudice costituzionale

Giudice
type: Class
comment: Definisce un giudice all'interno della Corte Costituzionale.
subclass of: Persona