Giudice
type: Class
comment: Definisce un giudice all'interno della Corte Costituzionale.
subclass of: Persona

Sabino Cassese
type: Giudice
comment: Professore ordinario di diritto amministrativo, nato ad Atripalda (Av) il 20 ottobre1935, nominato dal Presidente della Repubblica il 4 novembre 2005. Giura il 9 novembre 2005.
surname: CASSESE
title: Giudice costituzionale