Giudice
type: Class
comment: Definisce un giudice all'interno della Corte Costituzionale.
subclass of: Persona

Franco Gallo
type: Giudice
comment: Professore ordinario di diritto tributario, nato a Roma il 23 aprile 1937, nominato dal Presidente della Repubblica il 14 settembre 2004. Giura il 16 settembre 2004. Eletto Presidente il 29 gennaio 2013.
surname: GALLO F.
title: Presidente